{"text_format":"1","workbook":"xlsx","n_sheets":9,"sheets":["Vejledning","Oplysninger","Beregninger","Udskrift","Transport","Input regnskab","Datagrundlag","Finansiering","Fraktilgrupper"],"not_rendered":{"charts":1,"images":0,"macros":1,"external_links":0,"defined_names":280,"comments":1,"pivot_tables":0},"unopened":[],"bounds":{"document_bytes":16777216,"sheet_cells":100000,"rows_first":2000,"rows_last":500,"rows_between":2000,"halvings":0,"cell_chars":16384,"cell_head_chars":4096},"cells_cut":0,"cells_raw":0,"read":"whole","date_system":"1900"}

{"sheet":"Vejledning","index":0,"n_rows":39,"n_cols":10,"rows_kept":39,"cut":false,"hidden":false,"merged":[[27,1,27,14],[28,1,30,14],[32,1,34,14],[3,1,8,5],[9,9,12,12],[14,9,14,13],[13,9,13,13],[13,1,14,5],[16,1,17,5],[10,1,11,5]]}
[]
[null,"Indtjeningssimulering på plantebrug"]
[]
[null,"Med dette regneark kan man beregne økonomien ved tilførelse eller afgivelse af arealer, afhængig af forventet afgrødesammensætning, priser og omkostningsniveauer mv. Værdier fra gældende afgrædekalkuler foreslås som standard i beregningen. ",null,null,null,null,null,null,"Udgiver:","SEGES"]
[null,null,null,null,null,null,null,null,null,"Erhvervsøkonomi"]
[null,null,null,null,null,null,null,null,"Udgivelsesdato:","2020-12-01"]
[null,null,null,null,null,null,null,null,"Forfatter:","Morten Nyland Christensen og Ove Lund"]
[null,null,null,null,null,null,null,null,"Version:","4.0"]
{"$rows_left_out":32}
{"sheet":"Oplysninger","index":1,"n_rows":36,"n_cols":17,"rows_kept":36,"cut":false,"hidden":false,"merged":[[18,7,23,7],[33,1,34,7],[35,1,36,7],[2,3,2,5],[29,1,29,2]]}
[]
[]
[null,null,null,"Oplysninger i mørkeblå felter stammer fra regnskabet. Kan overskrives via de lyseblå felter til højre for. De grønne celler er der en drop down boks der kan vælges oplysninger til.",null,null,null,null,null,"Celler som skal skjules"]
[]
[null,"Oplysninger om bedrift "]
[]
[null,"Basisoplysninger"]
[null,"CVR.nr.",null,{"$f":"IF(F8<>\"\",F8,J8)","v":38264125},null,38264125,null,null,null,{"$f":"IFERROR(VLOOKUP(L8,'Input regnskab'!$A$1:$G$10000,7,FALSE),\"\")","v":27025676},null,6425]
{"$rows_left_out":29}
{"sheet":"Beregninger","index":2,"n_rows":75,"n_cols":81,"rows_kept":75,"cut":false,"hidden":false,"merged":[[33,76,33,77],[33,78,33,79],[33,80,33,81],[33,32,33,33],[24,64,24,65],[24,32,24,33],[33,64,33,65],[33,66,33,67],[33,68,33,69],[24,46,24,47],[33,54,33,55],[33,56,33,57],[33,58,33,59],[33,60,33,61],[33,62,33,63],[33,44,33,45],[33,70,33,71],[33,72,33,73],[33,74,33,75],[24,34,24,35],[24,58,24,59],[24,56,24,57],[24,36,24,37],[24,62,24,63],[24,48,24,49],[24,50,24,51],[24,52,24,53],[24,54,24,55],[24,60,24,61],[33,48,33,49],[33,50,33,51],[33,52,33,53],[24,24,24,25],[24,26,24,27],[24,38,24,39],[24,42,24,43],[24,44,24,45],[24,40,24,41],[24,28,24,29],[24,30,24,31],[33,34,33,35],[33,36,33,37],[33,38,33,39],[33,40,33,41],[33,42,33,43],[33,24,33,25],[33,26,33,27],[33,30,33,31],[25,19,30,19],[42,18,47,18],[34,18,39,18],[34,19,39,19],[42,19,47,19],[25,18,30,18],[33,28,33,29],[74,1,74,83],[59,24,61,64],[41,24,43,64],[49,24,51,64],[34,1,35,1],[45,3,45,4],[46,3,46,4],[47,3,47,4],[42,3,42,4],[43,3,43,4],[44,3,44,4],[57,1,57,10],[63,1,63,10],[71,1,71,10],[43,10,46,10],[35,10,38,10]]}
[null,"Beregning af indtjening pr. ha"]
[null,null,null,null,null,"Kalkule/egne","Enhed","Regnskab","Egne værdier",null,null,null,null,null,"Skjules",null,"Skjules"]
[]
[null,"Bruttoudbytte"]
[null,"Udbytter:",{"$f":"IF(Oplysninger!C19=\"Ingen eller andet\",\"\",Oplysninger!C19)","v":"Vårbyg"},{"$f":"IF(OR(Oplysninger!C19=\"Ingen eller andet\",Oplysninger!C19=\"\"),\"\",Oplysninger!C19&\" på \"&Oplysninger!D$10&Oplysninger!J$11)","v":"Vårbyg på sandjord med vanding med gylle"},null,{"$f":"IF(I5=\"\",O5,I5)","v":60},{"$f":"IF(Oplysninger!$C19=\"Majs til helsæd\",\"FEN pr. ha\",IF(Oplysninger!$C19=\"Slætgræs 4 slæt\",\"FEN pr. ha\",\"hkg. pr. ha\"))","v":"hkg. pr. ha"},{"$f":"IFERROR(VLOOKUP(C5,Datagrundlag!$A$22:$K$37,Datagrundlag!$K$21,FALSE),\"\")","v":66.037735849056602},null,null,{"$f":"IFERROR(_xlfn.IFS(AND(D5<>\"\",F5=0),\"ingen kalkule, intast egen værdi\",D5=\"\",\"Vælge afgrøde, hvis ønsket\"),\"\")","v":""},null,null,null,{"$f":"IF(ISNUMBER(Q5),Q5,0)","v":60},null,{"$f":"VLOOKUP(D5,Datagrundlag!M$70:O$153,2,FALSE)","v":60}]
[null,null,{"$f":"IF(Oplysninger!C20=\"Ingen eller andet\",\"\",Oplysninger!C20)","v":"Vinterhvede"},{"$f":"IF(OR(Oplysninger!C20=\"Ingen eller andet\",Oplysninger!C20=\"\"),\"\",Oplysninger!C20&\" på \"&Oplysninger!D$10&Oplysninger!J$11)","v":"Vinterhvede på sandjord med vanding med gylle"},null,84,{"$f":"IF(Oplysninger!$C20=\"Majs til helsæd\",\"FEN pr. ha\",IF(Oplysninger!$C20=\"Slætgræs 4 slæt\",\"FEN pr. ha\",\"hkg. pr. ha\"))","v":"hkg. pr. ha"},{"$f":"IFERROR(VLOOKUP(C6,Datagrundlag!$A$22:$K$37,Datagrundlag!$K$21,FALSE),\"\")","v":0},null,null,{"$f":"IFERROR(_xlfn.IFS(AND(D6<>\"\",F6=0),\"ingen kalkule, intast egen værdi\",D6=\"\",\"Vælge afgrøde, hvis ønsket\"),\"\")","v":""},null,null,null,{"$f":"IF(ISNUMBER(Q6),Q6,0)","v":84},null,{"$f":"VLOOKUP(D6,Datagrundlag!M$70:P$153,2,FALSE)","v":84}]
[null,null,{"$f":"IF(Oplysninger!C21=\"Ingen eller andet\",\"\",Oplysninger!C21)","v":"Vinterraps"},{"$f":"IF(OR(Oplysninger!C21=\"Ingen eller andet\",Oplysninger!C21=\"\"),\"\",Oplysninger!C21&\" på \"&Oplysninger!D$10&Oplysninger!J$11)","v":"Vinterraps på sandjord med vanding med gylle"},null,40,{"$f":"IF(Oplysninger!$C21=\"Majs til helsæd\",\"FEN pr. ha\",IF(Oplysninger!$C21=\"Slætgræs 4 slæt\",\"FEN pr. ha\",\"hkg. pr. ha\"))","v":"hkg. pr. ha"},{"$f":"IFERROR(VLOOKUP(C7,Datagrundlag!$A$22:$K$37,Datagrundlag!$K$21,FALSE),\"\")","v":0},null,null,{"$f":"IFERROR(_xlfn.IFS(AND(D7<>\"\",F7=0),\"ingen kalkule, intast egen værdi\",D7=\"\",\"Vælge afgrøde, hvis ønsket\"),\"\")","v":""},null,null,null,40,null,{"$f":"VLOOKUP(D7,Datagrundlag!M$70:P$153,2,FALSE)","v":40}]
[null,null,{"$f":"IF(Oplysninger!C22=\"Ingen eller andet\",\"\",Oplysninger!C22)","v":"Majs til helsæd"},{"$f":"IF(OR(Oplysninger!C22=\"Ingen eller andet\",Oplysninger!C22=\"\"),\"\",Oplysninger!C22&\" på \"&Oplysninger!D$10&Oplysninger!J$11)","v":"Majs til helsæd på sandjord med vanding med gylle"},null,11800,{"$f":"IF(Oplysninger!$C22=\"Majs til helsæd\",\"FEN pr. ha\",IF(Oplysninger!$C22=\"Slætgræs 4 slæt\",\"FEN pr. ha\",\"hkg. pr. ha\"))","v":"FEN pr. ha"},{"$f":"IFERROR(VLOOKUP(C8,Datagrundlag!$A$22:$K$37,Datagrundlag!$K$21,FALSE),\"\")","v":0},null,null,{"$f":"IFERROR(_xlfn.IFS(AND(D8<>\"\",F8=0),\"ingen kalkule, intast egen værdi\",D8=\"\",\"Vælge afgrøde, hvis ønsket\"),\"\")","v":""},null,null,null,11800,null,{"$f":"VLOOKUP(D8,Datagrundlag!M$70:P$153,2,FALSE)","v":11800}]
{"$rows_left_out":68}
{"sheet":"Udskrift","index":3,"n_rows":41,"n_cols":8,"rows_kept":41,"cut":false,"hidden":false,"merged":[[23,1,23,3],[15,4,15,5],[16,4,16,5],[17,4,17,5],[18,4,18,5],[19,4,19,5]]}
[]
[null,"Resultat og sammenligning"]
[]
[null,{"$f":"Beregninger!B23","v":"Bruttoudbytte i alt (vægtet gennemsnit)"},null,null,null,{"$f":"IF(B4=Beregninger!B23,Beregninger!F23,\"\")","v":7585}]
[null,{"$f":"Beregninger!B32","v":"Stykomkostninger (vægtet gennemsnit)*"},null,null,null,{"$f":"IF(B5=Beregninger!B32,Beregninger!F32,\"\")","v":-1770.95}]
[null,{"$f":"Beregninger!B33","v":"Dækningsbidrag"},null,null,null,{"$f":"IF(B6=Beregninger!B33,Beregninger!F33,\"\")","v":7201.55}]
[null,{"$f":"Beregninger!B42","v":"Maskinomkostninger inkl. arbejde (korrigeret for arbejdstid og kapacitet)"},null,null,null,{"$f":"IF(B7=Beregninger!B42,Beregninger!F42,\"\")","v":-6427.8160000000007}]
[null,{"$f":"Beregninger!B49","v":"Transportomkostninger (vægtet gennemsnit)"},null,null,null,{"$f":"IF(B8=Beregninger!B49,Beregninger!F49,\"\")","v":-168.55670103092785}]
{"$rows_left_out":34}
{"sheet":"Transport","index":4,"n_rows":55,"n_cols":32,"rows_kept":55,"cut":false,"hidden":false,"merged":[[2,1,4,1],[2,2,2,3],[2,4,2,5],[2,6,2,7],[2,8,2,9],[30,12,31,13],[2,12,2,13],[3,2,3,3],[3,4,3,5],[3,6,3,7],[3,8,3,9],[3,10,3,11],[3,12,3,13],[2,10,2,11]]}
[null,"Beregning af tid og omkostninger til transport til nye areal"]
[]
[null,"Antal transporter til og fra forpagtet areal",{"$f":"IF(Oplysninger!$C19=\"Ingen eller andet\",Beregninger!D11,Oplysninger!$C19)","v":"Vårbyg"},null,{"$f":"IF(Oplysninger!$C20=\"Ingen eller andet\",Beregninger!D12,Oplysninger!$C20)","v":"Vinterhvede"},null,{"$f":"IF(Oplysninger!$C21=\"Ingen eller andet\",Beregninger!D13,Oplysninger!$C21)","v":"Vinterraps"},null,{"$f":"IF(Oplysninger!$C22=\"Ingen eller andet\",Beregninger!D14,Oplysninger!$C22)","v":"Majs til helsæd"},null,{"$f":"IF(Oplysninger!$C23=\"Ingen eller andet\",Beregninger!D15,Oplysninger!$C23)","v":"Fabriksroer"},null,{"$f":"IF(Oplysninger!$C24=\"Ingen eller andet\",Beregninger!D16,Oplysninger!$C24)","v":"Slætgræs 4 slæt"}]
[null,null,{"$f":"_xlfn.CONCAT(\"Antal ha: \",TEXT(Oplysninger!$D9*Oplysninger!$D19,\"#.##0,0\"))","v":"Antal ha: 24,3"},null,{"$f":"_xlfn.CONCAT(\"Antal ha: \",TEXT(Oplysninger!$D9*Oplysninger!$D20,\"#.##0,0\"))","v":"Antal ha: 48,5"},null,{"$f":"_xlfn.CONCAT(\"Antal ha: \",TEXT(Oplysninger!$D9*Oplysninger!$D21,\"#.##0,0\"))","v":"Antal ha: 9,7"},null,{"$f":"_xlfn.CONCAT(\"Antal ha: \",TEXT(Oplysninger!$D9*Oplysninger!$D22,\"#.##0,0\"))","v":"Antal ha: 14,6"},null,{"$f":"_xlfn.CONCAT(\"Antal ha: \",TEXT(Oplysninger!$D9*Oplysninger!$D23,\"#.##0,0\"))","v":"Antal ha: 0,0"},null,{"$f":"_xlfn.CONCAT(\"Antal ha: \",TEXT(Oplysninger!$D9*Oplysninger!$D24,\"#.##0,0\"))","v":"Antal ha: 0,0"},null,null,null,null,"Budgetkalkuler (opdateres når behov opstår)"]
[null,null,"Egen vurdering (alle ha)","Budget-kalkule\n(alle ha) ","Egen vurdering (alle ha)","Budget-kalkule\n(alle ha) ","Egen vurdering (alle ha)","Budget-kalkule\n(alle ha) ","Egen vurdering (alle ha)","Budget-kalkule\n(alle ha) ","Egen vurdering (alle ha)","Budget-kalkule\n(alle ha) ","Egen vurdering (alle ha)","Budget-kalkule\n(alle ha) ",null,null,null,"Vårbyg","Vinterrug","Havre","Vinterhvede","Vinterraps","Vinterbyg","Majs til helsæd","Fabriksroer","Stivelseskartofler","Læggekartofler","Spisekartofler","Proceskartofler","Alm. rajgræs","Slætgræs 4 slæt","Ingen eller andet"]
[null,"Plov og jordpakker (1)",null,{"$f":"IF(C6=\"\",ROUNDUP(HLOOKUP(Oplysninger!$C$19,Transport!$R$5:$AF$26,2,)*Oplysninger!$D$9*Oplysninger!$D$19/$I31,0),0)","v":2},null,{"$f":"IF(E6=\"\",ROUNDUP(HLOOKUP(Oplysninger!$C$20,Transport!$R$5:$AF$26,2,)*Oplysninger!$D$9*Oplysninger!$D$20/$I31,0),0)","v":3},null,{"$f":"IF(G6=\"\",ROUNDUP(HLOOKUP(Oplysninger!$C$21,Transport!$R$5:$AF$26,2,)*Oplysninger!$D$9*Oplysninger!$D$21/$I31,0),0)","v":1},null,{"$f":"IF(I6=\"\",ROUNDUP(HLOOKUP(Oplysninger!$C$22,Transport!$R$5:$AF$26,2,)*Oplysninger!$D$9*Oplysninger!$D$22/$I31,0),0)","v":1},null,{"$f":"IF(K6=\"\",ROUNDUP(HLOOKUP(Oplysninger!$C$23,Transport!$R$5:$AF$26,2,)*Oplysninger!$D$9*Oplysninger!$D$23/$I31,0),0)","v":0},null,{"$f":"IF(M6=\"\",ROUNDUP(HLOOKUP(Oplysninger!$C$24,Transport!$R$5:$AF$26,2,)*Oplysninger!$D$9*Oplysninger!$D$24/$I31,0),0)","v":0},null,"Plov og jordpakker",null,1,1,1,1,1,1,1,1,1,1,1,1]
[null,"Stensamling",null,{"$f":"IF(C7=\"\",HLOOKUP(Oplysninger!$C$19,Transport!$R$5:$AF$26,3,),0)","v":0},null,{"$f":"IF(E7=\"\",HLOOKUP(Oplysninger!$C$20,Transport!$R$5:$AF$26,3,),0)","v":0},null,{"$f":"IF(G7=\"\",HLOOKUP(Oplysninger!$C$21,Transport!$R$5:$AF$26,3,),0)","v":0},null,{"$f":"IF(I7=\"\",HLOOKUP(Oplysninger!$C$22,Transport!$R$5:$AF$26,3,),0)","v":0},null,{"$f":"IF(K7=\"\",HLOOKUP(Oplysninger!$C$23,Transport!$R$5:$AF$26,3,),0)","v":0},null,{"$f":"IF(M7=\"\",HLOOKUP(Oplysninger!$C$24,Transport!$R$5:$AF$26,3,),0)","v":0},null,"Stensamling"]
[null,"Tromle (2)",null,{"$f":"IF(C8=\"\",ROUNDUP(HLOOKUP(Oplysninger!$C$19,Transport!$R$5:$AF$26,4,)*Oplysninger!$D$9*Oplysninger!$D$19/$I32,0),0)","v":0},null,{"$f":"IF(E8=\"\",ROUNDUP(HLOOKUP(Oplysninger!$C$20,Transport!$R$5:$AF$26,4,)*Oplysninger!$D$9*Oplysninger!$D$20/$I32,0),0)","v":0},null,{"$f":"IF(G8=\"\",ROUNDUP(HLOOKUP(Oplysninger!$C$21,Transport!$R$5:$AF$26,4,)*Oplysninger!$D$9*Oplysninger!$D$21/$I32,0),0)","v":0},null,{"$f":"IF(I8=\"\",ROUNDUP(HLOOKUP(Oplysninger!$C$22,Transport!$R$5:$AF$26,4,)*Oplysninger!$D$9*Oplysninger!$D$22/$I32,0),0)","v":1},null,{"$f":"IF(K8=\"\",ROUNDUP(HLOOKUP(Oplysninger!$C$23,Transport!$R$5:$AF$26,4,)*Oplysninger!$D$9*Oplysninger!$D$23/$I32,0),0)","v":0},null,{"$f":"IF(M8=\"\",ROUNDUP(HLOOKUP(Oplysninger!$C$24,Transport!$R$5:$AF$26,4,)*Oplysninger!$D$9*Oplysninger!$D$24/$I32,0),0)","v":0},null,"Tromle",null,null,null,null,null,null,null,{"$f":"X7+1","v":1},null,null,null,null,{"$f":"AC7+1","v":1}]
{"$rows_left_out":48}
{"sheet":"Input regnskab","index":5,"n_rows":380,"n_cols":7,"rows_kept":380,"cut":false,"hidden":false,"merged":[]}
["Id","VariabelNavn","Beskrivelse","Type","ProdGren","EnhedsKode","Vaerdi"]
[1,1,"Dato for dannelse","Ø90ØkonomiData",0,0,190320]
[2,2,"Kørselstidspunkt","Ø90ØkonomiData",0,0,1035]
[3,3,"Bestillingsnummer","Ø90ØkonomiData",0,0,510]
[11,11,"Uden ekstra indberetning (J=1,N=-1), (Ingen supl. opl.)","Ø90ØkonomiData",0,0,1]
[12,12,"Produktionsgrundlag (J=1,N=-1), (kun supl. opl. til prod.gr.)","Ø90ØkonomiData",0,0,1]
[13,13,"Med ekstra indberetning (J=1,N=-1), (sup. opl. ”alle” analyser)","Ø90ØkonomiData",0,0,0]
[14,14,"P-grens opgørelse (J=1,N=-1), (samme konto / sup.opl. kan forekomme på mere end 1 prod. gren)","Ø90ØkonomiData",0,0,0]
{"$rows_left_out":373}
{"sheet":"Datagrundlag","index":6,"n_rows":257,"n_cols":68,"rows_kept":257,"cut":false,"hidden":false,"merged":[[171,15,171,34],[171,37,171,65]]}
[null,null,null,null,null,null,null,null,null,null,null,null,"DATAGRUNDLAG (budgetkalkuler okt. 2020 for 2021)"]
[null,null,null,null,null,null,null,null,null,null,null,null,"Opdateret 21.10.2020 ovl"]
[null,null,null,null,null,null,null,null,null,null,null,null,null,null,"Valgfelt (ja/nej)"]
[null,null,null,null,null,null,null,null,null,null,null,null,"Jordbund",null,null,"Ja"]
[1,{"$f":"A5+1","v":2},{"$f":"B5+1","v":3},4,5,6,null,null,null,null,null,null,null,null,null,"Nej"]
[null,"refnr beløb","refnr kv","Værdi","værdi","pris",null,null,null,null,null,null,"lerjord"]
[{"$f":"O9","v":"Byg"},7016,7018,{"$f":"IFERROR(VLOOKUP(B7,'Input regnskab'!$A$1:$G$10000,7,0),0)","v":3725093},{"$f":"IFERROR(VLOOKUP(C7,'Input regnskab'!$A$1:$G$10000,7,0),0)","v":2624070},{"$f":"IFERROR(D7/E7*100,0)","v":141.95859866543194},null,null,null,null,null,null,"sandjord uden vanding",null,"Opdateres årligt efter budgetkalkulerne i FarmtalOnline"]
["Hvede",7020,7022,{"$f":"IFERROR(VLOOKUP(B8,'Input regnskab'!$A$1:$G$10000,7,0),0)","v":0},{"$f":"IFERROR(VLOOKUP(C8,'Input regnskab'!$A$1:$G$10000,7,0),0)","v":0},{"$f":"IFERROR(D8/E8*100,0)","v":0},null,null,null,null,null,null,"sandjord med vanding",null,"Priser","Kr. pr. hkg."]
{"$rows_left_out":250}
{"sheet":"Finansiering","index":7,"n_rows":162,"n_cols":14,"rows_kept":162,"cut":false,"hidden":false,"merged":[[1,2,1,5],[6,13,7,14],[21,2,21,6]]}
[]
[null,"Investering i:","Kombisæt",null,null,null,null,null,"Oplysninger der kan lægges til allerede oplyste omkostninger for den/de afgrøder"]
[null,null,null,null," ",null,null,null,"der benytter ny tilkøbte maskine."]
[]
[]
[null,"Oplysninger om finansiering",null,null,null,null,null,null,"Oplysninger om afskrivninger"]
[null,null,null,null,null,null,null,null,null,null,null,null,null,"Gå tilbage til fane med beregning"]
[null,"Lånedata",null,null,{"$f":"IF(AND(C12>0,C13>0,C15>0,C16>0),\"Låneoplysninger:\",0)","v":"Låneoplysninger:"},null,null,null,"Afskivningsdata"]
{"$rows_left_out":155}
{"sheet":"Fraktilgrupper","index":8,"n_rows":87,"n_cols":17,"rows_kept":87,"cut":false,"hidden":true,"merged":[]}
["Landsdel","type","FTO_jb","FTO_jbx","x.Antal","x.MQ00_20","x.MQ00_20x","x.MQ20_40","x.MQ20_40x","x.MQ40_60","x.MQ40_60x","x.MQ60_80","x.MQ60_80x","x.MQ80_100","x.MQ80_100x","Dummy 1","Dummy2"]
["Lolland-Falster","Husdyrproduktion","2",{"$f":"_xlfn.IFS(Tabel1[[#This Row],[FTO_jb]]=\"1\",\"JB1&3\",Tabel1[[#This Row],[FTO_jb]]=\"2\",\"JB2&4\",Tabel1[[#This Row],[FTO_jb]]=\"3\",\"JB5&6\",Tabel1[[#This Row],[FTO_jb]]=\"4\",\"JB7&8\",Tabel1[[#This Row],[FTO_jb]]=\"Alle\",Tabel1[[#This Row],[FTO_jb]])","v":"JB2&4"},2,"NaN",{"$f":"IF(Tabel1[[#This Row],[x.MQ00_20]]=\"NaN\",\"\",VALUE(Tabel1[[#This Row],[x.MQ00_20]]))","v":""},"NaN",{"$f":"IF(Tabel1[[#This Row],[x.MQ20_40]]=\"NaN\",\"\",VALUE(Tabel1[[#This Row],[x.MQ20_40]]))","v":""},"NaN",{"$f":"IF(Tabel1[[#This Row],[x.MQ40_60]]=\"NaN\",\"\",VALUE(Tabel1[[#This Row],[x.MQ40_60]]))","v":""},"NaN",{"$f":"IF(Tabel1[[#This Row],[x.MQ60_80]]=\"NaN\",\"\",VALUE(Tabel1[[#This Row],[x.MQ60_80]]))","v":""},"NaN",{"$f":"IF(Tabel1[[#This Row],[x.MQ80_100]]=\"NaN\",\"\",VALUE(Tabel1[[#This Row],[x.MQ80_100]]))","v":""}]
["Lolland-Falster","Husdyrproduktion","3",{"$f":"_xlfn.IFS(Tabel1[[#This Row],[FTO_jb]]=\"1\",\"JB1&3\",Tabel1[[#This Row],[FTO_jb]]=\"2\",\"JB2&4\",Tabel1[[#This Row],[FTO_jb]]=\"3\",\"JB5&6\",Tabel1[[#This Row],[FTO_jb]]=\"4\",\"JB7&8\",Tabel1[[#This Row],[FTO_jb]]=\"Alle\",Tabel1[[#This Row],[FTO_jb]])","v":"JB5&6"},23,"NaN",{"$f":"IF(Tabel1[[#This Row],[x.MQ00_20]]=\"NaN\",\"\",VALUE(Tabel1[[#This Row],[x.MQ00_20]]))","v":""},"NaN",{"$f":"IF(Tabel1[[#This Row],[x.MQ20_40]]=\"NaN\",\"\",VALUE(Tabel1[[#This Row],[x.MQ20_40]]))","v":""},"NaN",{"$f":"IF(Tabel1[[#This Row],[x.MQ40_60]]=\"NaN\",\"\",VALUE(Tabel1[[#This Row],[x.MQ40_60]]))","v":""},"NaN",{"$f":"IF(Tabel1[[#This Row],[x.MQ60_80]]=\"NaN\",\"\",VALUE(Tabel1[[#This Row],[x.MQ60_80]]))","v":""},"NaN",{"$f":"IF(Tabel1[[#This Row],[x.MQ80_100]]=\"NaN\",\"\",VALUE(Tabel1[[#This Row],[x.MQ80_100]]))","v":""}]
["Lolland-Falster","Husdyrproduktion","4",{"$f":"_xlfn.IFS(Tabel1[[#This Row],[FTO_jb]]=\"1\",\"JB1&3\",Tabel1[[#This Row],[FTO_jb]]=\"2\",\"JB2&4\",Tabel1[[#This Row],[FTO_jb]]=\"3\",\"JB5&6\",Tabel1[[#This Row],[FTO_jb]]=\"4\",\"JB7&8\",Tabel1[[#This Row],[FTO_jb]]=\"Alle\",Tabel1[[#This Row],[FTO_jb]])","v":"JB7&8"},12,"NaN",{"$f":"IF(Tabel1[[#This Row],[x.MQ00_20]]=\"NaN\",\"\",VALUE(Tabel1[[#This Row],[x.MQ00_20]]))","v":""},"NaN",{"$f":"IF(Tabel1[[#This Row],[x.MQ20_40]]=\"NaN\",\"\",VALUE(Tabel1[[#This Row],[x.MQ20_40]]))","v":""},"NaN",{"$f":"IF(Tabel1[[#This Row],[x.MQ40_60]]=\"NaN\",\"\",VALUE(Tabel1[[#This Row],[x.MQ40_60]]))","v":""},"NaN",{"$f":"IF(Tabel1[[#This Row],[x.MQ60_80]]=\"NaN\",\"\",VALUE(Tabel1[[#This Row],[x.MQ60_80]]))","v":""},"NaN",{"$f":"IF(Tabel1[[#This Row],[x.MQ80_100]]=\"NaN\",\"\",VALUE(Tabel1[[#This Row],[x.MQ80_100]]))","v":""}]
["Lolland-Falster","Planteavl","1",{"$f":"_xlfn.IFS(Tabel1[[#This Row],[FTO_jb]]=\"1\",\"JB1&3\",Tabel1[[#This Row],[FTO_jb]]=\"2\",\"JB2&4\",Tabel1[[#This Row],[FTO_jb]]=\"3\",\"JB5&6\",Tabel1[[#This Row],[FTO_jb]]=\"4\",\"JB7&8\",Tabel1[[#This Row],[FTO_jb]]=\"Alle\",Tabel1[[#This Row],[FTO_jb]])","v":"JB1&3"},1,"NaN",{"$f":"IF(Tabel1[[#This Row],[x.MQ00_20]]=\"NaN\",\"\",VALUE(Tabel1[[#This Row],[x.MQ00_20]]))","v":""},"NaN",{"$f":"IF(Tabel1[[#This Row],[x.MQ20_40]]=\"NaN\",\"\",VALUE(Tabel1[[#This Row],[x.MQ20_40]]))","v":""},"NaN",{"$f":"IF(Tabel1[[#This Row],[x.MQ40_60]]=\"NaN\",\"\",VALUE(Tabel1[[#This Row],[x.MQ40_60]]))","v":""},"NaN",{"$f":"IF(Tabel1[[#This Row],[x.MQ60_80]]=\"NaN\",\"\",VALUE(Tabel1[[#This Row],[x.MQ60_80]]))","v":""},"NaN",{"$f":"IF(Tabel1[[#This Row],[x.MQ80_100]]=\"NaN\",\"\",VALUE(Tabel1[[#This Row],[x.MQ80_100]]))","v":""}]
["Lolland-Falster","Planteavl","2",{"$f":"_xlfn.IFS(Tabel1[[#This Row],[FTO_jb]]=\"1\",\"JB1&3\",Tabel1[[#This Row],[FTO_jb]]=\"2\",\"JB2&4\",Tabel1[[#This Row],[FTO_jb]]=\"3\",\"JB5&6\",Tabel1[[#This Row],[FTO_jb]]=\"4\",\"JB7&8\",Tabel1[[#This Row],[FTO_jb]]=\"Alle\",Tabel1[[#This Row],[FTO_jb]])","v":"JB2&4"},6,"NaN",{"$f":"IF(Tabel1[[#This Row],[x.MQ00_20]]=\"NaN\",\"\",VALUE(Tabel1[[#This Row],[x.MQ00_20]]))","v":""},"NaN",{"$f":"IF(Tabel1[[#This Row],[x.MQ20_40]]=\"NaN\",\"\",VALUE(Tabel1[[#This Row],[x.MQ20_40]]))","v":""},"NaN",{"$f":"IF(Tabel1[[#This Row],[x.MQ40_60]]=\"NaN\",\"\",VALUE(Tabel1[[#This Row],[x.MQ40_60]]))","v":""},"NaN",{"$f":"IF(Tabel1[[#This Row],[x.MQ60_80]]=\"NaN\",\"\",VALUE(Tabel1[[#This Row],[x.MQ60_80]]))","v":""},"NaN",{"$f":"IF(Tabel1[[#This Row],[x.MQ80_100]]=\"NaN\",\"\",VALUE(Tabel1[[#This Row],[x.MQ80_100]]))","v":""}]
["Lolland-Falster","Planteavl","3",{"$f":"_xlfn.IFS(Tabel1[[#This Row],[FTO_jb]]=\"1\",\"JB1&3\",Tabel1[[#This Row],[FTO_jb]]=\"2\",\"JB2&4\",Tabel1[[#This Row],[FTO_jb]]=\"3\",\"JB5&6\",Tabel1[[#This Row],[FTO_jb]]=\"4\",\"JB7&8\",Tabel1[[#This Row],[FTO_jb]]=\"Alle\",Tabel1[[#This Row],[FTO_jb]])","v":"JB5&6"},39,"NaN",{"$f":"IF(Tabel1[[#This Row],[x.MQ00_20]]=\"NaN\",\"\",VALUE(Tabel1[[#This Row],[x.MQ00_20]]))","v":""},"NaN",{"$f":"IF(Tabel1[[#This Row],[x.MQ20_40]]=\"NaN\",\"\",VALUE(Tabel1[[#This Row],[x.MQ20_40]]))","v":""},"NaN",{"$f":"IF(Tabel1[[#This Row],[x.MQ40_60]]=\"NaN\",\"\",VALUE(Tabel1[[#This Row],[x.MQ40_60]]))","v":""},"NaN",{"$f":"IF(Tabel1[[#This Row],[x.MQ60_80]]=\"NaN\",\"\",VALUE(Tabel1[[#This Row],[x.MQ60_80]]))","v":""},"NaN",{"$f":"IF(Tabel1[[#This Row],[x.MQ80_100]]=\"NaN\",\"\",VALUE(Tabel1[[#This Row],[x.MQ80_100]]))","v":""}]
["Lolland-Falster","Planteavl","4",{"$f":"_xlfn.IFS(Tabel1[[#This Row],[FTO_jb]]=\"1\",\"JB1&3\",Tabel1[[#This Row],[FTO_jb]]=\"2\",\"JB2&4\",Tabel1[[#This Row],[FTO_jb]]=\"3\",\"JB5&6\",Tabel1[[#This Row],[FTO_jb]]=\"4\",\"JB7&8\",Tabel1[[#This Row],[FTO_jb]]=\"Alle\",Tabel1[[#This Row],[FTO_jb]])","v":"JB7&8"},36,"NaN",{"$f":"IF(Tabel1[[#This Row],[x.MQ00_20]]=\"NaN\",\"\",VALUE(Tabel1[[#This Row],[x.MQ00_20]]))","v":""},"NaN",{"$f":"IF(Tabel1[[#This Row],[x.MQ20_40]]=\"NaN\",\"\",VALUE(Tabel1[[#This Row],[x.MQ20_40]]))","v":""},"NaN",{"$f":"IF(Tabel1[[#This Row],[x.MQ40_60]]=\"NaN\",\"\",VALUE(Tabel1[[#This Row],[x.MQ40_60]]))","v":""},"NaN",{"$f":"IF(Tabel1[[#This Row],[x.MQ60_80]]=\"NaN\",\"\",VALUE(Tabel1[[#This Row],[x.MQ60_80]]))","v":""},"NaN",{"$f":"IF(Tabel1[[#This Row],[x.MQ80_100]]=\"NaN\",\"\",VALUE(Tabel1[[#This Row],[x.MQ80_100]]))","v":""}]
{"$rows_left_out":79}